Home > Return Code > Return Code '0x460

Return Code '0x460

NMAKE : fatal error U1077: '"C:\Program Files (x86)\Microsoft Visual Studio 11.0 \VC\BIN\nmake.exe"' : return code '0x2' Stop. I configured configure -debug-and-release -opensource -platform win32-msvc2012 -opengl desktop -nomake examples -nomake tests and I did set the compiler path by running C:\Program Files (x86)\Microsoft Visual Studio 11.0\VC\bin\vcvars32.bat It compiles for C:\Program Files (x86)\MSBuild\Microsoft.Cpp\v4.0\V110\Microsoft.CppCommon.targets 329 Error 31 error U1077: 'copy' : return code '0x1' C:\Win64Compilation\httpd-2.2.21\NMAKE Error 32 error U1077: '"C:\Program Files (x86)\Microsoft Visual Studio 11.0\VC\bin\nmake.exe"' : return code '0x2' C:\Win64Compilation\httpd-2.2.21\NMAKE Error 33 Reply Quote 0 DanielRMueller last edited by I am compiling 64 Bit and have only the 64 bit compiler paths in the path ,so that shouldn't be it. http://juicecoms.com/return-code/eza1735i-std-return-code-10234-error-code-00010.html

NMAKE : fatal error U1077: 'cd' : return code '0x2' Stop. @ Reply Quote 0 kingofthehill3 last edited by This error occurs both with release and debug. I've performed each step as you recommended, but I'm still receiving the same error message. How can I check if this is for 32 bit or for 64 bit? Related Content Join the 15-year community celebration.

RSS Top 7 posts / 0 new Last post For more complete information about compiler optimizations, see our Optimization Notice. cl -c -Fo./ -W3 -nologo -O2 /MP -I. -Igenerators -Igenerators\unix -Igenerators\win32 -Igenerators\mac -Igenerators\symbian -IE:\qt_source\include -IE:\qt_source\include\QtCore -IE:\qt_source\include -IE:\qt_source\include\QtCore -IE:\qt_source\src\corelib \global -IE:\qt_source\src\corelib\xml -IE:\qt_source\mkspecs\win32-msvc2010 -IE:\qt_source\tools\shared -DQT_NO_TEXTCODEC -DQT_NO _UNICODETABLES -DQT_LITE_COMPONENT -DQT_NODLL -DQT_NO_STL -DQT_NO_COMPRESS -DUNICODE -DHAVE_QCONFIG_CPP In the catalog file see if the dependencies are included in the catalog file such that the functions mentioned included in a module is getting compiled. Any help is appreciated.

NMAKE : fatal error U1077: 'cd' : return code '0x2' Stop. You will see mkl.dll in the same directory. Learn more MATLAB and Simulink resources for Arduino, LEGO, and Raspberry Pi Learn more Discover what MATLAB® can do for your career. Steffen Back to top glsmithModeratorJoined: 16 Oct 2007Posts: 2035Location: Sun Diego, USA Posted: Fri 25 Nov '11 12:17 Post subject: Just saying error LNK2011: precompiled object not linked in; image may

If so - make sure you delete all the .obj, .pdb, and (especially!) any .pch files before you build. Launch vcvarsall.bat was the solution. –dlopezgonzalez Nov 29 '12 at 13:10 | show 5 more comments up vote 0 down vote when you configured you forgot to add the comipiler option.. I'm fairly sure the only problem is that djacobi isn't in mkl_intel_lp64_dll.lib, mkl_intel_thread_dll.lib, mkl_core_dll.lib or libiomp5md.lib and we need to add the library it is in unfortunately I have no idea get redirected here Join the conversation Skip site navigation (1) Skip section navigation (2) Search Peripheral Links Donate Contact Home About Download Documentation Community Developers Support Your account Community Contributors Mailing Lists Subscribe User

c++ qt compilation linker-error share|improve this question edited Mar 27 '14 at 8:51 asked Mar 20 '14 at 16:53 S.H 246318 add a comment| 1 Answer 1 active oldest votes up To find the required libraries try to use Intel Math Kernel Library Link Line Advisor http://software.intel.com/en-us/articles/intel-mkl-link-line-advisor/. Can time travel make us rich through trading, and is this a problem? NMAKE : fatal error U1077: 'cd' : return code '0x2' Stop.

Why do shampoo ingredient labels feature the the term "Aqua"? http://stackoverflow.com/questions/22539927/compiling-qt-5-2-1-for-win32-msvc-fails-due-to-linker-errors Download Intel_MKL_C#_Examples.zip from the http://software.intel.com/en-us/articles/using-intel-mkl-in-your-c-program/ 2. a life without programming its alike empty bottle Go to the top of the page Skip user information larryliuming Beginner Posts: 2 3 Friday, June 17th 2005, 4:39am Thanks for your Or the current version?

That doesn't make sense at all ... navigate here Currently, I'm trying to compile httpd (2.2.21-win32) with zlib (1.2.5) and openssl (1.0.0e) under Windows 7 (x64) with Microsoft Visual Studio 10.0 for AMD64. Reply Quote 0 kingofthehill3 last edited by I found my problem! Top Back to original post Leave a Comment Please sign in to add a comment.

Visit our UserVoice Page to submit and vote on ideas! www.Eurotech.com Marked as answer by Liang1 Friday, May 17, 2013 7:26 PM Thursday, May 16, 2013 6:54 PM Reply | Quote Moderator All replies 1 Sign in to vote Verify the This is the error output: link /NOLOGO /DYNAMICBASE /NXCOMPAT /DEBUG /DLL /OUT:..\..\..\..\plugins\platforms\qwindowsd.dll @C:\Users\steffenh\AppData\Local\Temp\nm9509.tmp Creating library ..\..\..\..\plugins\platforms\qwindowsd.lib and object ..\..\..\..\plugins\platforms\qwindowsd.exp dlldata.obj : error LNK2001: unresolved external symbol _Accessible2_ProxyFileInfo dlldata.obj : error LNK2001: http://juicecoms.com/return-code/vsam-catalog-return-code-is-8-reason-code-is-igg0cleg-42.html I don't know what to do now...Does anyone fix the problem before?

Privacy statement Help us improve MSDN. The path to QT could have easily been picked up from the QTDIR env var by the "qt-integration-VS2003_1.0.1.exe" program when it installed. The Perl expression is case-insensitive: Code: FOR /R %F IN (*.mak *.mk.win) DO perl -pi.bak -e "s/\/MACHINE:X[0-9]*//gi" %F It is suspicious that your failure is in the first Makefile which has

Output N in base -10 What is this blue thing in a photograph of a bright light?

Reload the page to see its updated state. Perhaps you should pass this oversight on to the development team and have them fix it so that others won't encounter the same problem and be pestering you with questions like Greg. Join today Support Terms of Use *Trademarks Privacy Cookies Publications Intel® Developer Zone Newsletter Intel® Parallel Universe Magazine Look for us on: FacebookTwitterGoogle+LinkedInYouTube English简体中文EspañolPortuguês Rate Us Apache LoungeWebmasters About Forum Index

or A donation makes a contribution towards the costs, the time and effort that's going in this site and building. Yes, I did. If everything is fine try with clean sysgen. this contact form NMAKE : >> fatal error U1077: 'E:\VS2003\VC7\BIN\nmake.exe' : return code '0x2' >> Stop." > Since nmake is a Qt feature and the path of NMAKE.EXE should point to Qt > directory.

The process cannot access the file 'C:\Win64Compilation\httpd-2.2.21\modules\aaa\Release\cl.read.1.tlog' because it is being used by another process. more stack exchange communities company blog Stack Exchange Inbox Reputation and Badges sign up log in tour help Tour Start here for a quick overview of the site Help Center Detailed Running syncqt... Developer Network Developer Network Developer :CreateViewProfileText: Sign in Subscriber portal Get tools Downloads Visual Studio SDKs Trial software Free downloads Office resources SharePoint Server 2013 resources SQL Server 2014 Express

Extract the content into any directory, there are 7 files: 05/27/2009 03:16 PM 9,676 dfti_d1.cs05/27/2009 03:16 PM 5,117 dgeev.cs05/27/2009 03:15 PM 4,412 dgemm.cs08/10/2010 10:54 PM 3,858 makefile08/10/2010 09:37 PM 222 MKLfunctions.lst05/27/2009 Learning resources Microsoft Virtual Academy Channel 9 MSDN Magazine Community Forums Blogs Codeplex Support Self support Programs BizSpark (for startups) Microsoft Imagine (for students) United States (English) Newsletter Privacy & cookies Discover... I have the same linkage problem and option “-no-accessibility” does not help..

NMAKE : fatal error U1077: 'cd' : return code '0x2' Stop. On what OS and version? All rights reserved. It looks Bluetooth Serial profile module is not compiled.

Ask a question Quick access Forums home Browse forums users FAQ Search related threads Remove From My Forums Answered by: error SYSGEN0000: NMAKE : fatal error U1077: 'link' : return code NMAKE : fatal error U1077: '"C:\Program Files (x86)\Microsoft Visual Studio 11.0 \VC\BIN\nmake.EXE"' : return code '0x2' Stop. Asked by MathWorks Support Team MathWorks Support Team (view profile) 13,579 questions 13,579 answers 13,578 accepted answers Reputation: 2,937 on 1 Apr 2014 Latest activity Answered by MathWorks Support Team MathWorks