Home > Failed With > Error Command 'link.exe' Failed With Exit Status 1120

Error Command 'link.exe' Failed With Exit Status 1120

Contents

No, thanks Search: LoginHelp/GuideAbout TracPreferences WikiTimelineRoadmapView TicketsNew TicketSearch Context Navigation Server Load Average: 0.38 Search Tickets Milestones Changesets Wiki Results (1 - 10 of 368) 1 2 3 4 Personal Open source Business Explore Sign up Sign in Pricing Blog Support Search GitHub This repository Watch 548 Star 11,305 Fork 1,382 kripken/emscripten Code Issues 829 Pull requests 99 Projects Adding it to the path resolved that issue. I got a little farther with a custom header based on the MinGW-w64 one, some of them need to be implemented in Clang itself, like the Interlocked* family of functions navigate here

Is there any reason for an index to contain the primary key? Comment 4 João Matos 2013-03-26 20:39:44 CDT FYI, some intrinsics needed for header support in MSVC 2012 have landed in r178111. At this point I'm quite unsure how to continue debugging. Trying simple : clang tests/hello_world.cpp I am getting the following error: c:\Program Files\Emscripten\emscripten\1.13.0>clang++ tests/hello_world.cpp hello_world-005255.o : error LNK2019: unresolved external symbol printf referenc ed in function main LINK : error LNK2001:

Error Command 'link.exe' Failed With Exit Status 1120

Comment 8 kumquats.a.pair 2014-01-22 22:58:39 CST This does not compile with clang-cl.exe but it does using cl.exe: #include void** Dest; void* Exch; void* Comp; int main(void) { long x = Here is what I am using on Microsoft Windows. Collaborator juj commented Dec 8, 2012 I tried with "-fmsc-version= -U_MSC_VER -DUSE_DL_PREFIX", but that fails with test_dlmalloc (__main__.benchmark) ... Thanks, Sharad.

interlocked_decrement-199938.o : error LNK2019: unresolved external symbol __InterlockedDecrement referenced in function _main a.out : fatal error LNK1120: 1 unresolved externals clang: error: linker command failed with exit code 1120 (use -v Skip to content Ignore Learn more Please note that GitHub no longer supports old versions of Firefox. The fixed version is available at https://dl.dropbox.com/u/40949268/Bugs/clang/dlmalloc_clang.cpp This allows the application to build and link successfully. Cx_oracle Download The linker error disappear as soon as I add {{{#include }}} By [email protected]… — 06/28/16 04:01:57 #12301: Bugs: problem building 1.61.0 (new) ...

dlmalloc is pure C code, and I tried to rename the file to .c and build it with clang, to confirm that there at least are no global C++ class dtors Thanks, Sharad. Is the binomial theorem actually more efficient than just distributing I lost my equals key. Action: Check that any custom tasks/types have been declared.

Free forum by Nabble Edit this page Bitbucket Features Pricing owner/repository English English 日本語 Sign up Log in wheezy.template Actions Clone Compare Fork Navigation Overview Source Commits Branches 2 Pull requests Cx_oracle Install What is the "crystal ball" in the meteorological station? Your Answer draft saved draft discarded Sign up or log in Sign up using Google Sign up using Facebook Sign up using Email and Password Post as a guest Name By [email protected]… — 07/20/16 08:38:26 #12303: Bugs: Linker error with boost.locale and operator% (new) ...

Visual C++ For Python Failed With Exit Status 1120

After I included the above target I get errors: 1) Could not load definitions from resource org/apache/tools/ant/antlib.xml. click for more info Yes, you can build extensions for 32-bit Python on 64-bit Windows, but not with 64-bit Python." 2014-08-27T10:09:28+00:00 Joshua Moore-Oliva I am not running 64 bit python. Error Command 'link.exe' Failed With Exit Status 1120 Explicitly call dlmalloc and dlfree in dlmalloc_test.c to enforce that the native Win32 test really calls dlmalloc instead of the system malloc. Error: Command 'amd64\\link.exe' Failed With Exit Status 1120 Hacker used picture upload to get PHP code into my site Where can I report criminal intent found on the dark web?

Home | New | Browse | Search | [?] | Reports | Help | Log In [x] | Forgot Password Login: [x] SourceForge Browse Enterprise Blog Deals Help Create Log In check over here If you would like to refer to this comment somewhere else in this project, copy and paste the following link: Log in to post a comment. It could not be found. Comments (14) Andriy Kornatskyy repo owner The issue is most likely related to Python3.4 and Visual Studio. Cx_oracle Dll Load Failed

Reload to refresh your session. Explicitly call dlmalloc and dlfree in dlmalloc_test.c to enforce that the native Win32 test really calls dlmalloc instead of the system malloc. I am running 32bit python on a 64bit machine. his comment is here Collaborator juj commented Dec 11, 2012 Yes we can, the pull request I made works around the Clang issue by not trying to use the intrinsics instructions when compiling on Windows,

current community chat Stack Overflow Meta Stack Overflow your communities Sign up or log in to customize your list. Python Download We also get a macro redefinition warning when we define BOOST_ALL_NO_LIB in user.hpp header. By [email protected]… — 11/30/16 01:22:42 #12565: Bugs: LTO Build Fails with lockpool.o: not an object or archive (closed: invalid) Hi, While compiling boost with LTO on both gcc and llvm/clang, the

more stack exchange communities company blog Stack Exchange Inbox Reputation and Badges sign up log in tour help Tour Start here for a quick overview of the site Help Center Detailed

If you would like to refer to this comment somewhere else in this project, copy and paste the following link: Adrian Ber - 2009-02-01 Probably it is a little bit late Browse other questions tagged clang emscripten or ask your own question. Browse other questions tagged windows python-3.x visual-c++ pip or ask your own question. You signed out in another tab or window.

Contents of table bigger than the rest of the text and also not centered Can time travel make us rich through trading, and is this a problem? clang --driver-mode=cl or clang-cl /cl But clang-cl not support RIIT so ,Your must using -D_HAS_EXCEPTIONS=0 &&/GR- Now; For example: If clang:clang --driver-mode=cl -D_HAS_EXCEPTIONS=0 /GR- file.cppIf clang-cl or cl:clang-cl -D_HAS_EXCEPTIONS=0 /GR- file.cpp------------------------------------Original------------------From: Fixes #743. fa188e1 Owner kripken commented Dec 6, 2012 Hmm, can we just add some -U.. weblink For the record, following the tutorial, I am able to compile hello_world_sdl.cpp by emcc into html, but not hello_world.cpp by clang - a similar yet different linker path issue. –Gassa Mar

Is the binomial theorem actually more efficient than just distributing Movie about a girl who had another different life when she dreamed Print all ASCII alphanumeric characters without using them Dealing I will try it on Monday just in case though, and post the entire output log. -DMS_WIN64 doesn't make any sense since I am trying to compile a 32 bit extension. See http://ant-contrib.sourceforge.net/cc.html for more information. Learn how to clone a repository.

obj builder.c c:\Program Files (x86)\Microsoft Visual Studio 10.0\VC\BIN\link.exe /DLL /nologo /INCREMENTAL:NO /LIBPATH:C:\Python34\libs /LIBPATH:C:\Python34\PCbuild /EXPORT:PyInit_builder build\temp.win32-3.4\Release\src\wheezy\template\builder.obj /OUT :build\lib.win32-3.4\wheezy\template\builder.pyd /IMPLIB:build\temp.win32-3.4\Release\src\wheezy\template\builder.lib /MANIFESTFILE:build\temp.win32-3.4\Release\src\wheezy\template\builder.pyd.manifest Creating library build\temp.win32-3.4\Release\src\wheezy\template\builder.lib and object build\temp.win32-3.4\Release\src\wheezy\template\builder.exp building 'wheezy.template.comp' extension c:\Program Files (x86)\Microsoft Collaborator juj commented Dec 5, 2012 Further investigation indicates that clang gets confused by dlmalloc defining malloc and free itself. By [email protected]… — 04/22/16 14:26:39 1 2 3 4 5 6 7 8 9 10 11 → Note: See TracSearch for help on searching. From zero to parabola in 2 symbols How can "USB stick" online identification possibly work?

One should probably then explicitly call dlmalloc and dlfree instead of malloc and free to use dlmalloc.