Home > Failed To > Failed To Locate Cl.exe

Failed To Locate Cl.exe

The system cannot find the file specified. ★★★★★★★★★★★★★★★ Deva [MSFT]March 24, 20152 Share 0 0 Like earlier, I was involved in migration of VS 2013 C++ Outlook add-in project which was Reload to refresh your session. TRACKER : error TRK0005: Failed to locate: "CL.exe". Tuesday, December 18, 2012 5:03 AM Reply | Quote 0 Sign in to vote problem is easily solved by going to VS2010 and setting the executable directory withing the project settings... Check This Out

How did Adebisi make his hat hanging on his head? The reason was that I decided to install VS2015 to "C:\program files (x86)\msvc14", but the installer installed cl.exe to the default "c:\program files (x86)\Microsoft Visual Studio 14.0" path. TargetFrameworkVersion or PlatformToolset may be set to an invalid version number. [C:\Users\ap\Desktop\WebChimera.js\build\CMakeFiles\3.2.3\CompilerIdC\CompilerIdC.vcxproj] Creating directory "Debug\CompilerIdC.tlog\". Already have an account?

CreatCodeBuild commented Nov 23, 2015 Hi smikes, I tried what you suggested and it worked. about | faq | help | privacy policy Powered by Askbot version 0.7.53 Please note: OpenCV answers requires javascript to work properly, please enable javascript in your browser, here is how Which one should I use?

Tuesday, December 18, 2012 5:03 AM Reply | Quote 0 Sign in to vote problem is easily solved by going to VS2010 and setting the executable directory withing the project settings... Is an animated corpse with a weapon overpowered? It really seems that cl.exe does not exists. messages.

The issue will get fixed. (BTW, I am using VS2015 on Win10) Here is the another reference link: http://stackoverflow.com/a/33716573/4468648 share|improve this answer edited Nov 8 '16 at 0:46 answered Jul 15 I hope my suggestion can help you to resolve your issue. A package may try to re-compile itself using node-gyp. TargetFrameworkVersion or PlatformToolset may be set to an invalid versio n number. [C:\Users\user\AppData\Roaming\npm\node_modules\generator-keystone\node_modules\buffertools\build\buffertool s.vcxproj] TRACKER : error TRK0005: Failed to locate: "CL.exe".

I had installed Visual Studio 2015 on my machine. If the re-compile fails, the package recovers (typically with a pre-built version) and everything works." https://angular.io/docs/ts/latest/quickstart.html#!#npm-errors share|improve this answer answered Jan 18 '16 at 11:17 Antfish 13114 1 only sometimes The system cannot find the file specified. 1> 1> ========== Build: 0 succeeded, 1 failed, 0 up-to-date, 0 skipped ========== pls help me edit retag flag offensive close merge delete add So it should be in your Visual Studio installation directory.

Why are copper cables round? http://stackoverflow.com/questions/33239445/could-not-install-prerender-using-npm-failed-to-locate-cl-exe Terms Privacy Security Status Help You can't perform that action at this time. Reload to refresh your session. Build started 7/23/2015 4:47:41 PM.

I tried running the following commands, but I'm still getting the same results. his comment is here Marked as answer by Rob Pan Thursday, June 02, 2011 1:42 AM Monday, May 30, 2011 9:01 AM Reply | Quote 0 Sign in to vote As Rob Pan commented, You The system cannot find the file specified. [C:\PreRender\node_modules\prerender\node_modules\phantom\node _modules\dnode\node_modules\weak\build\weakref.vcxproj] gyp ERR! Encryption - How to claim authorship anonymously?

The system cannot find the file specified up vote 43 down vote favorite 20 I want to install bcrypt on a windows 10 machine with visual studio community 2015, Python v2.7.3 Finally, today, you proved me wrong - I can finally compile nodejs modules like a boss. –bigp Aug 25 '16 at 12:57 | show 1 more comment up vote 13 down C:\Program Files (x86)\MSBuild\Microsoft.Cpp\v4.0\V140\Microsoft.CppBuild.targets(366,5): warning MSB8003: Could not find WindowsSDKDir variable from the registry. http://juicecoms.com/failed-to/failed-to-locate-supported-file.html Or it's merely an ordinary mistake?

npm v2.14.7 npm ERR! Executed the npm install prerender from the Developer Command Prompt in of Visual Studio 2015, running in Administrator mode share|improve this answer answered Oct 21 '15 at 8:36 Karl Cassar 2,17122062 command "C:\\Program Files (x86)\\nodejs\\node.exe" "C:\\Users\\user\\AppData\\Roaming\\npm\\node_modules\\npm \\node_modules\\node-gyp\\bin\\node-gyp.js" "rebuild" gyp ERR!

node -v v5.0.0 gyp ERR!

For Windows, we recommend using Visual Studio Community 2013. Keeping windshield ice-free without heater What are the benefits of an oral exam? Honestly, I'm not sure which one solved it completely as I've done quite some stuff. Tell the author that this fails on your system: npm ERR!

It looks like npm can't find the C compiler, which it needs in order to build the C++ module that provides node-sass. Marked as answer by Rob Pan Thursday, June 02, 2011 1:42 AM Monday, May 30, 2011 9:01 AM Reply | Quote All replies 1 Sign in to vote Hi Arc, contents of table bigger than rest of text and also not centered What are the benefits of an oral exam? navigate here npm ERR!

Is it bad practice to use GET method as login username/password for administrators? So it should be in your Visual Studio installation directory such as C:/Program Files\Microsoft Visual Studio 10.0\VC\ce\bin. You signed out in another tab or window. If you create a new C++ project then main frame would show you 2 options for Install extra packages.

stack Error: `C:\Program Files (x86)\MSBuild\14.0\bin\msbuild.exe` failed with exit code: 1 gyp ERR! Below is a summary of what I've done: Installed Visual C++ Compiler, from the VS 2015 installation. My Electron build package comprises Electron (development dependency version) and Photon. Can time travel make us rich through trading, and is this a problem?

gerwinbrunner commented Jul 23, 2015 It's working fine with VS C 2015 now Owner RSATom commented Jul 27, 2015 @gerwinbrunner, what was the problem? Happy debugging!! Can this number be written in (3^x) - 1 format? I've installed Python 2.7.10.

Any idea what could be wrong? node version v4.2.1 node-gyp v3.0.3 npm install bcrypt C:\Users\ASMIN\Desktop\M2\app>npm install bcrypt npm WARN package.json [email protected] No description npm WARN package.json [email protected] No repository field. The system cannot find the file specified. [C:\Users\user\AppData \Roaming\npm\node_modules\generator-keystone\node_modules\buffertools\build\buffertools.vcxproj] gyp ERR! stack at ChildProcess.emit (events.js:172:7) gyp ERR!

more stack exchange communities company blog Stack Exchange Inbox Reputation and Badges sign up log in tour help Tour Start here for a quick overview of the site Help Center Detailed What does Joker “with TM” mean in the Deck of Many Things? contents of table bigger than rest of text and also not centered Can time travel make us rich through trading, and is this a problem? stack at emitTwo (events.js:87:13) gyp ERR!