Home > Failed To

failed to boot jboss java.lang.classnotfoundexception

failed to load sound file probably missing from disk/repository gmod

failed to read firewall configuration nod32

failed to assign spn on account error 0x21c7/8647

service dhcpd start failed redhat

chroot failed to run command /bin/bash exec format error

failed to set entityresolver to null on

failed to set up passive data socket for putfile

nslookup fails but ping works

oracle vm virtualbox extension pack

msgina.dll download

service ntpdate start failed

astraweb

sharp aquos failed to receive broadcast

failed to load resource server responded with a status of 404

exchmem.dll location

jbas018740: failed to mount deployment content

failed to set default parameters from server/database

failed to initialize the gamestartup interface warface

failed to create msscriptcontrol.scriptcontrol

failed to get dsp mailbox handle

tgb dual

failed to check template consistency code 70

failed to create a display device divx player

failed to enumerate cannot prune

failed to start monitoring changes to global.asax because access is denied

failed to play picture message

file_put_contents failed to open stream permission denied laravel

bandicam failed to start video capture

ultravnc failed to connect to server windows 10

failed to send message to mq queue

failed to distribute odms to node

failed to resolve slp from wins sccm

failed to receive data the tls connection was non-properly terminated

the module comdlg32.ocx was loaded but the call to dllregisterserver failed

players failed to load content halo 3

failed to initialize the nvidia kernel module ubuntu

failed to create d3d device left 4 dead 2 non steam

failed to load vboxapi windows 7

failed to receive broadcast e202 sharp

arcserve failed to login to the agent

failed to locate program unrar in path

wlstexception: error occured while performing connect : user: weblogic, failed to be authenticated.

failed to read parameter object

internal error failed to expand shell folder constant userdocs windows 7

failed to load selinux policy freezing rhel7

soapui error loading wsdl failed to load url https

failed to load kext applehdacontroller

keyboard initialization failed. this could be a missing or incorrect setup of xkeyboard-config.

failed to create empty document nero

failed to download a platform extension c1.silverlight.data.zip

named.service failed

failed to execute request because the app-domain could not be created 1088

wmi remote access denied

failed to write data to the disk

failed to recover nbdb

how to fix signature verification failed installation aborted

failed to refresh site code. error 0x8000ffff 2012

failed to add act.dot template to word

failed to create a version

comment failed to post youtube

failed to find steam jade empire

failed to update microcode from version 0x0 to 0x3

failed to connect sde not running on server

failed to read /etc/nut/upsmon.conf

unable to extract gfxboot-theme-ubuntu source package

failed to create the virtualbox com object regdb_e_classnotreg

failed to erase card security status not satisfied

wfcrun32 error unable to launch application

failed to start the symantec management client service safe mode

failed to get acpi path for provider

1 file failed to validate and will be reacquired skyrim

failed to connect to master server tony hawk

keytool error java.lang.exception failed to establish chain from reply linux

failed to connect to ipc port sharepoint

failed to download content id error invalid certificate signature

ssis excel source failed to retrieve long data for column

failed to download and start g2mdlhlpx.exe

failed to resolve slp from wins

symefasi

failed to create share name not unique

failed to contact game server cs 1.6 solution

failed to recognize

failed to lazily initialize a collection of role jpa

proc-26: error while accessing the physical storage

failed to register com server autocad

exportfs

asp.net ajax client-side framework failed to load sys is undefined

failed to load the vba project for the display

failed to save components for the file system32

failed to lock main memory file . vem

the cause of the failure was: system.io.filenotfoundexception: could not load file or assembly

gtk-message failed to load module canberra-gtk-module ubuntu

failed to load file storage card initrd.gz

directorycontext

failed to create configuration database sharepoint 2010

ubuntu 14.04 failed to download package files

failed to launch server application crystal reports

failed to detect if active directory domain services binaries were installed

wpa_supplicant exited with return code 1

symantec teefer install has stopped working uninstall

failed to reboot client to recovery partition

the peer is not responding to phase 1 isakmp requests sonicwall vpn

createtestuser : mailbox could not be created

failed to retrieve stub from server localhost 8080

failed to read from inotify

failed to create designer telerik.web.ui.radbutton

failed to create d3d device cs go windows 10

failed to valid the proxy address template

failed to compile vmmon ubuntu 11.10

logmein hamachi mac not working

failed to clear url cache

failed to create the visual basic module

failed to global.cki download crossfire ph 2016

failed to retrieve environment variable lc_all

rsync: failed to exec ssh: no such file or directory

apt get webmin

tekkit server failed to bind to port hamachi

failed to connect to server teamspeak 3 fix

coolkey linux

nba 2k14 crack only reloaded

ubuntu apt-cdrom

failed to configure the single sign on server

failed to create socket ftp

error found on the file system, please tick sector by sector recovery(or clone) and try again.

failed to load wlm nosched dll

failed to obtain db connection from data source

failed to open stream ftp server reports retr

failed to set bluetooth power connection timed out

failed to send to identified host 5.0.0

acronis failed to read from sector of hard disk 1

failed to create sqldmo sqlserver object lync

failed to get cdma rx diversity

msme product database failed to store a record

failed to unload app domain defaultdomain 0x80131015

failed to initialize hal linux

failed to fetch security.debian.org

failed to send message to remote axl server

failed to make directory operation not applicable

could not connect to one or more vcenter server systems 443/sdk appliance

failed to proxy exchange web services to active directory site

failed to load mencoder

failed to open video decoder algorithm h264enc

failed to upload package to epo server 4.0

failed to get and initialize the pe provider windows 7

vboxweb-service missing

failed to initialize services.exe

failed to grab 1gb of continuous memory

didn't find the ldap server!

failed to connect to ftp server wordpress 3.2

the dependency service or group failed to start windows 7

failed to collect critical information for asr backup

failed to load kernel module i915

failed to enable crypto php

the module dll c:\windows\system32\inetsrv\webdav.dll failed to load. the data is the error.

virtualbox failed to attach the usb device busy with a previous request

github sync failed the repository doesn seem to exist anymore

clientscene registerprefab

sccm 2012 client failed to update site assignment

fsockopen() failed to enable crypto codeigniter

the uri is already registered with the service

failed to build the subject name blob

failed to activate receiver dish network

regasm register dll

failed to retrieve data from the database crystal reports

genclntsh failed to link libclntsh.so.11.1 oracle

failed to initialize the nvidia gpu at pci:1:0:0.

dhcpd.service: main process exited, code=exited, status=1/failure

failed to map ports not an igd device plex

vncserver.service not found

failed to load d3d9.dll

failed to update the system registry inpage 2009

solidworks initializing vba engine

failed to reserve track invalid field in cdb imgburn

failed to start the database service mssql$sharepoint. repair this product

failed to setup directshow filter graph

notepad++ failed to locate the main schema resource

failed to save last-line mode history

failed to install product catalogs xp

failed to build vmnet. failed to execute the build command. ubuntu

failed to connect to service manager

esxcli system module parameters list

fuse.conf user_allow_other

failed to initialize the common language runtime (clr) v2.0.50727 due to memory pressure.

failed to create service for net8 client

failed to connect to socket /var/run/dbus/system_bus_socket ubuntu 12.04

a general system error occurred migration to host failed with error already disconnected (0xbad002e)

failed to call designated initializer on nsmanagedobject class objective c

samba password reset

failed to open /dev/zap/transcode

vmware module disk power on failed

failed to start the apache http server centos 7

[email protected]:1.service: control process exited, code=exited status=2

%error copying system:/running-config (not enough space on device)

failed to set up rex system properly

failed to export pdf indesign

msg: failed to get sainfo.

failed to allocate internet-domain x11 socket

failed to load plugin /usr/lib64/audacious/input/sid.so

failed to bring up eth0 ubuntu 10.10

failed to initialize wds mode

opmn failed to start a managed process after the maximum retry limit

failed to open /var/lib/samba/secrets.tdb

failed to load xpcom component

failed to import appliance virtualbox bitnami

lmgrd failed to open the tcp port number in the license

failed to find method for hash

problem: failed to create task or type for cause: the name is undefined.

failed to mount windows share permission denied ubuntu

failed to get the test results at cactus

jax ws wsdl location

failed to reserve range

new password:retype new password:failed to read passwords.

arcgis (lmgrd) failed to open the tcp port number in the license

failed to load data from configuration database

failed to read a valid greeting from pop server pop.googlemail.com

cfgadm library error failed to create device node i/o error

unable to connect to system bus failed to connect to socket /var/run/dbus/system_bus_socket

550 failed to change directory ftp

mpc connection refused

csoftwaredistpolicymgr::getswdistsitesettings failed to connect to machine namespace

failed to load the internet connection wizard component

failed to monitor global.asax

failed to create the mailbox of

failed to read service provider catalog resource

failed to create a proxy device for the usb device verr_pdm_no_usb_ports

cannot open the disk or one of the snapshot disks it depends on. failed to lock the file

failed to call ldap in qc

failed to configure tk. it will not be installed.

failed to create direct3d device or initialize games for windows live

failed to load viewstate gridview edit

webspherewriterequestreadresponse: failed to find an app server to handle this request

failed to lookup view error in views directory node js

failed to read iiswebs table 2147023728

failed to compile the generated jsp java files

error during ssl handshake with remote server returned by /

failed to extract files from an archive starcraft 2

failed to parse json npm err unexpected token

failed to enable constraints tableadapter

php fopen failed to open stream permission denied

apt-get update failed to fetch 404

rsync error: error in ipc code (code 14)

veeam failed to initialize disks collection for original vm

dll failed to register hresult

failed to start database derby eclipse

ubuntu 16.04 failed to raise network

failed to connect to ssl server err=-1 reason=5

error - 2147467259: failed to create sql database"

vmware failed to create swap file not found

failed to load and parse the manifest cuda

failed to open date book database palm

failed to connect to the internet opera mini 4.2

module diskearly power on failed failed to lock the file

failed to determine connections virtual interface name

failed to open device nmap

xcode build failed no errors

failed to open smbios

failed to start monitoring changes to because access is denied

failed to clear url cache intellij idea

http access denied: user 'guest' - user can only log in via localhost

failed to initialize renderer skyrim fix

file_put_contents failed to open stream permission denied

failed to initialize directx 11 hitman absolution

failed to export report crystal 8.5

microsoft® sql server® 2012 powerpivot for microsoft sharepoint

ws_ftp import public key

failed to locate the desired database shared memory set

ao: [pulse] init failed: connection refused

failed to open stream no such file or directory in php

sshfs fuse bad mount point no such file or directory

google drive

failed to lock the file (40003) (0x2013)

failed to load steamui.dll 2016

failed to set the encryption key for secure backups 0x7dc

failed to set up graphic system dfo

failed to fetch security.ubuntu

acronis failed to write data to the disk access denied

failed to execute the request because the asp.net process identity

failed to build these modules: _hashlib

failed to join domain: invalid configuration ("workgroup" set to 'workgroup', should be

digsby failed to connect

norton 360 liveupdate failed to complete

failed to recover datastore vmfs volume residing on recovered devices cannot be found

failed to close sockio obj from deadpool

uvcvideo failed to query (get_def) uvc control

failed to load resource server responded with a status of 500

failed to set up sockaddr for 127.0.0.1

icmp port

org.slf4j.impl.staticloggerbinder jar

failed to add message into clients message queue

failed to load selinux policy. freezing rhel 7

failed to load usr lib xorg modules extensions libglcore so

failed to set write parameters imgburn

failed to open a connection to the database visual studio

failed to build gem native extension. /usr/bin/ruby extconf.rb

veeam unable to release guest unfreeze error

failed to initialize the appdomain asp net

failed to verify message. sending mp not in cached mplist.

telerik error creating control

failed to init application object. code 3

qlikview failed to open document you don't have access to this document

failed to execute arm

talonro failed to connect to server

frm-18108 failed to load the following objects during compilation

php copy failed to open stream: permission denied

server 2012 the dhcp service failed to see a directory server for authorization

failed to create ortho-corrected raster dataset

failed to launch scim

failed to configure ifolder3 server

failed to find steam longest journey

failed to startup steam

c# datatable disable constraints

failed to start mfc71.dll

failed to initialize the orb

1 channel failed to connect to url primewire

failed to start load kernel modules fedora 24

failed to emerge kde-base/kdeplasma-addons-4.4.5

failed to query the needed interfaces for dvd playback ratdvd

failed to parse tnsnames ora file

failed to load the launcher dll cs go

failed to access usb subsystem virtualbox windows

failed to retrieve share list from server ubuntu 11.10

soapui invalid definition exception

failed to query spn registration on dc 2003

the application failed to initialize properly 0xc0000022

failed to install catalogue files

failed to initialize font check the engine/game folder if default font is missing

failed to get error log address range centos 7

failed to allocate memory needed to run pcsx2

kali linux reaver warning failed to associate with

failed to open the log file lotusinstall.log.log

550 failed to open file vsftpd

failed to register msaddndr.dll vb6

failed to join domain failed to lookup dc info for domain over rpc

failed to access dbm file /var/asl/data/msa/global

caused by: java.lang.securityexception: user: weblogic, failed to be authenticated.

qemu-system-i386.exe: warning: opening audio input failed

slim failed to execute login command freebsd

sp flash tool this application has failed to start

failed to build the subject name

"failed to install the embedded database server"

securom failed to initialize pes 2013

ssis accessing variable failed with error code 0xc0010001

failed to find provider info for com.google.provider.notepad

what is javahl

failed to load library oleacc.dll

failed to get disc layout

getimagesize failed to open stream wordpress

failed to get root is your firmware too new

veeam failed to prepare guests for volume snapshot

imagejpeg failed to open stream no such file or directory

unable to access location failed to mount windows share permission denied

sshd error failed to allocate internet domain x11 display socket

failed to initialize libtcl

failed to import appliance bitnami

this application has failed to start because its side-by-side configuration is incorrect

failed to open file ui_igo8/common

virsh error: failed to connect to the hypervisor

failed to construct test pipeline for

failed to detect a portmapper service

failed to load module fbdevhw invalid module 0

failed to set serviceprincipalnames. please ensure that the dns domain

failed to connect to gaggle

failed to query spn registration ldap

failed to connect to the internet opera mini 4.4

failed to convert path to a short dos path android

failed to send a request to the message server

failed to create propertygrid

the windows logon process has failed to spawn a user application windows 7

failed to open default message store using mapi profile blackberry

failed to read artifact descriptor intellij

adobe cleaner tool

failed to generate hash for file

rpg maker mv failed to load actor data

failed to load bundle com.ibm.wmb.tools.prereq.check

failed to get dbprocess

org.codehaus.cargo.container.tomcat.internal.tomcatmanagerexception: fail - unable to delete

windows cannot complete the extraction

failed to create dbus proxy for org.gnome.settingsdaemon

failed to start remote control process 10013

failed to create virtual server the dns domain

failed to initialize libtcl.dll sybase

ssh2_scp_send(): failure creating remote file

(os 5)access is denied. failed to open the apache2.2 service

failed to setup virtual adapter error 1205 windows 7

warning: getinteractiveinstallprogress failed, error = 0x8024000c

failed to connect to computer perfectdisk

smbpasswd failed to add entry for user centos

ora-27211 failed to load media management library rman

failed to load btkrnl

failed to read byte block with byte transfer

download() failed with 0x80072ee2 sccm 2012 prerequisites

failed to read boot sector from bios device 100 h

failed to reserve track - reason invalid field in cdb

failed to create object. make sure the object is entered in the system registry corel

failed to read input internet explorer

failed to create page of type

failed to load javahl library eclipse windows

failed to lazily initialize a collection of role no session or session was closed

failed to add snap in file upload failed

(ee) failed to load module "nv" (module does not exist, 0)

failed to create fscopilot

failed to open connection to smtp server

error opening the portable document file pdf document error code 0x20030055

failed to execute web request for the specified url. unauthorized

failed to load viewstate the control tree into which

xencenter failed to import vhd

failed to probe for its manifest ntstatus 0xc0150002

warning require_once failed to open stream wordpress

failed to initialize the appdomain /lm/w3svc/1/root/autodiscover

failed to load an application resource (internal error) adobe reader

failed to load digiguide.dll

an operation required the virtual machine to quiesce and the virtual machine was unable to continue

failed to read lhef initialization information

failed to send smtp arcserve

failed to connect to dial up connection vista

failed to connect to wmi namespace root cimv2

failed to allocate memory android emulator

failed to boot 1 starting rsd mode

failed to emerge media-sound/alsa-utils

failed to connect to database arcgis 10

failed to load resource bundle from factory for key citrix

failed to execute udev socket

ora-28353: failed to open wallet 12c

failed to initialize the program will be shut down ro2

[lsass-pam] [module:pam_lsass]pam_sm_authenticate error

getthreadcontext example

failed to initialize the 1 midlet

java.lang.illegalstateexception failed to load applicationcontext spring boot

failed to create cache

supersu

failed to identify init dev params failed err mask 0x80

failed to fetch cdrom debian

channel count is not set at this point. not sip-sip or set_mode is not done.

failed to commit change on object exchange 2007

failed to enumerate domains in the forest

failed to enumerate dcs by using the browser 83b

failed to impersonate user with 5 lsass

failed to recover system system halted

arma 2 31 files failed to validate

steam failed to contact key server offline mode

libgl error: no matching fbconfigs or visuals found libgl error: failed to load driver: swrast

failed to allocate main memory

the key display name is either missing or has an incorrect value

module diskearly power on failed

failed to access netbt driver netbt may not be loaded

failed to get the crawl scope manager outlook 2013

failed to map vdisk no driver

failed to verify eeprom

failed to acquire license from the licensing module

failed to access the default store for the user

failed to register scheduler dll in avsynchmgr

failed to delete rename script on the dn

failed to load database information crystal reports visual studio 2013

cannot open the disk failed to lock the file

failed to initialize the nvidia graphics device ubuntu 10.10

failed to find hd boot partition

failed to get connection.connector not connected

runtimewarning com.ibm.ws.webcontainer.exception.webappnotloadedexception failed to load webapp

failed to create level directory

failed to read sector no seek complete

failed to find propertyeditor for type

failed to create receiver object from assembly for feature

failed to create the virtual machine unable to upload disk

failed to connect to ftp server localhost:21 ubuntu

failed to apply patch wow mac

failed to open archive interface.mpq warmane

failed to initialize hal edgy

failed to retrieve mppe encryption keys

failed to notify clvm daemon

ob_end_clean(): failed to delete buffer. no buffer to delete

failed to index an event will retry

physical device driver

apf-4-assocreq_proc_failed

failed to transform message before applying the filter

failed to set iopl for i/o ubuntu

failed to map segment from shared object: cannot allocate memory rails

failed to execute sql statement biztalk sql adapter

failed to initialize directx dead rising

failed to delay load library mscorlib

failed to ping remote vpn router quickvpn

failed to deserialize json object

failed to send notification using server/device scom

eectrl driver

failed to build vmnet. failed to execute the build command. fedora 24

failed to validate the xml content. cvc-complex-type.2.4.b

failed to install the hcmon driver windows 10

solaris 10 network configuration

error failed to retrieve repodata primary xml gz from rhel x86_64 server 6

gmdx problem starting up steam

value cannot be null parameter name dst_ip

smtp failed to connect to mail server in perl

failed to resolve schema binding for qname

failed to retrieve stub from server root exception is java.io.eofexception

problem: failed to create task or type if cause: the name is undefined.

document failed to print hp

libgl error: failed to open drm device: no such file or directory

failed to localize wsimport

failed to contact key server gta v

could not determine root device from /etc/fstab

 First - 1  - 2  - 3 - Last